Unity 2019 gradle build failed


1: Editor workflow & performance improvements. CommandInvokationFailure: Gradle build failed. There are two kinds of plug-ins you can use in More info See in Glossary instead of the old system, you may encounter build errors, especially if you are using additional Android libraries, or if you have added a custom AndroidManifest. AmazonPurchasing. Question. Here you can find project-based tutorials and topical guides to help you learn Gradle through using it. NilsFantastic September 11, 2019 Leave a comment. > Failed to apply plugin [id 'com. 1. attachment Run with --stacktrace option to get the stack trace. Symptoms. 7 version? I am using 発生している問題・エラーメッセージ. String You can either build the output package (APK) using the Gradle build system in Unity, or export the Gradle project and build it in an external tool (such as Android Studio). (iOS) Fixed issue which prevented the use of Unity Cloud Build with Unity 5. BuildPlayerWindow+BuildMethodException: Build failed with errors. 1: Fixed a bug where Visual Studio would fail to build projects using the Microsoft Xbox One XDK. These are the issues addressed in 15. 8 PROBLEM ÇÖZÜM 2018 unity çözüm gradle build failed I found out that unity has deprecated the internal build system and has defaulted to gradle. jar (:UnityAds:) and classes. For some reason your suggested change could not be submitted. 24 22:47 字数 74. See Console for details. 0 and higher include further improvements to optimize build speeds, such as per-class dexing (so that only the classes that you modify are re-dexed). Build AppBundle (Google Play) Gradle build failed in unity. Tutorial on how to export/build Android APK file from Unity and solving an error on this process and making of android apk file of that game. Reasons you might want to do this include: You want to make modifications to the application in Android Studio before building it. * What went wrong: Java heap space * Try: Run with --stacktrace option to get the stack trace. Execution failed for task project. 2019. The versions are 2. Unity打安卓包遇. 2. 9. application'] > Your project path contains non-ASCII characters. 0_152\bin\java. I solved the problem by using Jetifier and changing the manifest. Unity crashes and/or closes when i press the play button. srcaar files referenced by the project to . Some Gradle libraries were missing, Instead of directly building apk, tried to "Export Project", then opened it in Android Studio. 주의) Unity Preferences에서 NDK 폴더는 비워 둔다. 0_144\bin\java. 26f1 or later. Android plugin for Gradle, revision 1. FAILURE: Build failed with an exception. 1 or higher. 1f1, Vuforia 7 and Android Studio 3. fbx Asset changed. IUnityAdsListener found in modules classes. How do I support different configurations to build specific players by command line or auto build system? Exporting a project to Gradle and building/deploying on Android Studio; How do I read and write data from a text file? UNet Deprecation FAQ; Why does integrating Unity IAP result in compiler errors? Helpshift SDK depends on android support libraries and needs a gradle dependency for successfully building the library. OneSginalという超便利なプッシュ通知サービスがUnityで導入できますが、 私のプロジェクトだとiOSとAndroidのビルドどちらも失敗してしまいました。 今回はそれを修正してみました。 OneSignal SDKにはiOSビルド時に PostProcessBuild Билд с использованием Build System - Gradle(new) Unity При билде ошибка не могу найти решение, нужно именно в gradle сбилдить пробовал уже отключать в CommandInvokationFailure: Failed to build apk 5. 4. 8. 0 (July 2015) Dependencies: Gradle 2. Gradle checks in between build runs whether the input, output or an implementation of a task has changed since the last build invocation. . Please <a>try again</a> in a few minutes. But the build keeps failing, giving the error: Gradle build failed. If it doesn't, use the direct link News, Help, Resources, and Conversation. Export Project: Export the Project as a Gradle project that you can import into Android Studio. PostprocessBuildPlayer. Hi! I have Unity 2017. ~ Cannot read packageName (※) Unity 2018. Known Issues in 2019. all‘s APKTool FAILURE: Build failed with an exception. gradle Lots of professionals hang out there. If not, the task is considered up to date and is [Unity]Androidアプリ作成時に出たビルドエラーの倒し方01(Gradle build failed) 2018年11月22日 [Unity]ゲーム起動時に画面を横向きに設定する方法(Android) This tutorial describes the usage of the Gradle build system for building Android applications. 0a7. 0. 1 错误日志 FAILURE: Build failed with an exception. Unity3d's Tutorial Modules. ~ failed to find Build Tools revision 28. 16 06:22 Unity Unity . BuildTargetGroup targetGroup, UnityEditor. Unity's in-built gradle build support and exporting to android studio currently does not support per plugin gradle script. gradle and manifest to correspond to my respective AS versions and also changing it from an application to a library. If I didn't use Jetifier, build was failed. Gradle - Generate the output package (APK) using the Gradle build system. javaMaxHeapSize = 32g). In general the steps are. support. Whether you are new to Gradle or an experienced build master, the guides hosted here are designed to help you accomplish your goals. This guide will explain them in detail. Hey, I'm trying to build an android game. Remember to check out /r/unity2D for any 2D specific questions and conversation!. というエラーが出てしまいます。 Unity gradle build failed. 0b5 Android Gradle Build Failed #25. Unity 2018. При билде ошибка не могу найти решение, нужно именно в gradle сбилдить пробовал уже отключать в манифесте android:debuggable="false" безрезультатно. Run with --scan to get full insights. Be among the first to see what Unity has in store for you in the next 2019 TECH stream release. Java Project Tutorial - Make Login and Register Form Step by Step Using NetBeans And MySQL Database - Duration: 3:43:32. 2. android. jar file. [Unity Android] Unity 2019. These features affect developers running Gradle builds, and can be taken advantage of by anyone running Gradle. Run with --info or --debug option to get more log output. Make sure to include Android Build Support during installation. See console for details i've updated unity and this happened ! it is getting really frustrating I've installed many jdk version sdk versions change to internal build system tried to change to non-embedded jdk and vice versa i don't know any other solutions. Package for deployment on any platform. ads. Jadi gini, kalo misal udah bikin game dengan Unity, udah bagus-bagus dan pingin nge-deploy ke Android tapi gatau caranya, nah, mungkin tulisan ini bisa membantu. 유니티 빌드 시 나오는 오류 중 . C:\Program Files\Java\jdk1. To run dex in process, the Gradle daemon needs a larger heap. /r/Unity3D Chatroom. The Android Gradle plug-in A set of code created outside of Unity that creates functionality in Unity. multidex. [Unity Android] Admob - The Google Mobile Ads SDK was initialized incorrectly. Android - Fixed issue where instant app installs failed with the internal build system, because there was no APK Signature Scheme v2. 13 [Unity] 유니티 앱 이름 다국어 [Unity] Gradle build failed 오류 대응. gradle file Failed to initialize vuforia. [Unity Android] Build-in class shrinker and multidex are not supported yet. Clicking on developer options just shows developer options are not available to this user. その結果「Android SDK Build-Tools 29-rc1」がインストールされた。 この状態でAndoridビルドを行うと「Gradle prewarm failed」のエラーが発生し、ビルドできない状態になった。Gradleを使用せず、Internalでのビルドを行うと成功する状態。 対応 Visual Studio 2017 version 15. The unity installation package comes with Gradle installation and a gradle build file template which has a specific android gradle plugin version defined. For me, i just rollback Unity version to "Unity 2017. To build your Android build with Gradle in Unity Unity 2017. unity gradle 発生している問題・エラーメッセージ. gradle doesn't know what a . Postprocess (UnityEditor. exe -clas Unity打安卓包遇到的问题,大家知道怎么解决吗【unity3d吧】_百度贴吧 2019. It includes the information how to configure build flavors. ” gradle build skip tasks; 详解 build. unitypackage into your project; Add the WikitudeCamera and one of the Tracker prefabs to the Unity scene hierarchy and configure 在Unity和VS2017编辑时系统没有报错,但是向Hololens上building时报错。 UnityEditor. 두 오류 모두 공통 숫자인 65,536을 표시합니다. For faster builds, increase the maximum heap size for the Gradle daemon to at least 33280 MB (based on the dexOptions. 0, OpenJDK 1. Published on May 24, 2019. * Where: Build file 'G:\Program Files (x86)\unity\***\Temp\gradleOut\build. gradle' file: Unity 2019. " Unity在Gradle打包模式导出Android APK时,报错CommandInvokationFailure: Gradle build failed. manifest merger failed with multiple errors see logs react native manifest merger failed facebook manifest merger failed for task manifest merger failed fileprovider firebase manifest merger failed manifest merger failed attribute application@allowbackup value=(true) from androidmanifest. x or not. I just upgraded my project to Unity 2019. 0f2 버전 이었는데 이 버전의 문제가 유니티 에디터에서는 잘되는데 il2cpp에서 빌드 시 nox나 일부 폰에서 실행 오류가 나거나 화면이 안보이는 문제가 발생했습니다. Unity 内で Gradle を使って Android ビルドを作成するには以下の手順で行います。 Unity エディターで、Build Settings ウインドウ (File > Build Settings…) を開きます。 Platform リストで Android を選択します。 Build System ドロップダウンで Gradle (new) を選び、Build をクリック Build apk in Unity 2019 build Gradle تصدير التطبيق في يونتي 2019 خصم ممتاز على الخطة الشاملة لتعليم البرمجة Unity 2019. Gradle build failed. -Asset Import Fixed an issue where Unity failed to refresh the animation list after the source . 07. jar unity」で出て来た結果です。 unity3d - Gradle build for android in Unity fails, saying that it could not find intellij-core. See the console for details 2018. However, we still get fails when running Unity from the command line with -Xmx1024M set when Gradle is called. exe -classpath Билд с использованием Build System - Gradle(new) Unity При билде ошибка не могу найти решение, нужно именно в gradle сбилдить пробовал уже отключать в CommandInvokationFailure: Failed to build apk 在Unity和VS2017编辑时系统没有报错,但是向Hololens上building时报错。 UnityEditor. 22 [Unity] 유니티 패키지 매니저 사용하기 (Unity Package Manager) (0) 2019. gradle file and a build. 소스트리(Sourcetree) 사용법 - 특정 파. Gradle Build Failed Unity 2019. 0f2 버전 빌드 시 문제 . 7. Most codelabs will step you through the process of building a small application, or adding a new feature to an existing application. 7p1. 05. Click Troubleshoot to open the Gradle troubleshooting Unity  To configure and build apps for Android, access the Build Settings window (File > Gradle - Generate the output package (APK) using the Gradle build system. You can add other Build Jar > Copy Jar to Libs > Build Android Project. Dependency constraints, dependency alignment, and Unity 2019. xml\ Some of the new features in 2019. They freeze on Download pending message 5) Home and Switch buttons don't work. xml. Cause. It increases your potential iteration speeds when developing for Android, improves your workflow and gives you more control over the editor. Fixed in 2019. 25 [Unity] 유니티 애널리틱스 커스텀 이벤트 적용하기 (Unity Analytics) [Unity] Gradle build failed 오류 대응 - DexArchiveMergerException Estoy intentando añadir Firebase de Google a mi proyecto Unity para Android. C:/Program Files/Java/jdk1. build文件添加到Plugin / Android,这是一个相同的文件但是将不同的BuildToolsVersion设置为27. 【Unity / Gradle】 Unity 5. String installPath, System. 1 Additional downloads. 3. What went wrong: A problem occurred evaluating root project ‘gradleOut’. In order to fix this issue I had to do the following steps in this order: Delete Unity Ads plugin within the project; Save project and close Unity Change logs indicate that this is fixed in 2018. unity3d. /Users/dogo/Desktop/PRACA SSD/ParkIt/Bitbucket/ParkIt/Temp/gradleOut/build/intermediates/merged_manifests/release/processReleaseManifest/merged/AndroidManifest. unity. 34783 Unity ile ufak bir denemelik proje yaptım bunu androide çıkarmak istiyorum. com/threads/gradle-build-failed-after-update-to-unity-2018-3- 9f1 . 06. 22 暫く待つとスマホにUnityのロゴが表示されて、ゲームが起動したでしょうか? 起動したら成功です。 おめでとうございます! android端末にアプリを転送する時“Gradle build failed”が出るエラーの対処方法 我几天来一直在努力解决这个问题,我似乎无法找到解决问题的方法,这里是完整的错误: CommandInvokationFailure: Gradle build failed. 19 [Unity] Gradle build failed 오류 대응 - DexArchiveMergerException (0) 2019. 4) I can't update or install the apps on google play. Go monorepo or multi-repo. Now when I build the be specified in the app build. By default, Android projects are handled by the Gradle build system. VR开发这个是必选的(unity低版本貌似没有哦) Gradle build failed. CommandInvokationFailure: Gradle build failed. [Android] Gradle build fails when there's a settings. gradle build build failed unity build FAILURE Build failed build daily build build-rs BUILD FAILURE rpm. To run the unity module in AS i export it from unity to an android build using gradle. 0をいれるとandroidのビルド時にgradle build failedというエラーが出てしまいます。UnityAds2. &amp;gt; No toolchains found in t Unity打包时报错 Gradle build failed. Untiy Android SDK 추가 Build Unity에 Google PlaySevice를 먼저 설치 후 Vungle SDK를 추가 빌드 중 에러가 발생했다. - Gradle Build Error (Unity 2017. If you create a new project in Android studio, the Gradle build scripts are If you've never used Gradle before, it may seem like a frustrating barrier to entry when you're considering making the move to Android Studio. 5 or below or when using Unity Cloud Build. The Unity engine integrates into one unparalleled platform to create 2D and 3D games and interactive content. 2 (August 2019) This update fixes the following issue: librsjni_androidx. 1 Assume your Gradle project along with the Gradle wrapper In this tutorial, we will show you how to create Gradle wrapper for your project and how to use it. It supports Maven and Ivy repositories for retrieving these dependencies. See the Building with Gradle for Android section of Unity's documentation and the Providing a custom build. Unity Game Engine Syllabus (Getting Started Guide) 50 Tips and Best Practices for Symptoms. But it is not able to build. Im trying to build my game in unity using gradle but everytime that i tried i get this error: pls somebody help out with this CommandInvokationFailure: Gradle build failed. При билде ошибка не могу найти решение, нужно именно в gradle сбилдить пробовал уже отключать в манифесте android:debuggable="false" безрезультатно Ошибка CommandInvokationFailure: Gradle build f [Unity] Gradle build failed 오류 대응 - DexArchiveMergerException. 0f2 / Windows10(x64) / Galaxy S7 Edge (Android 7. 0 is the fastest, safest, and most capable Gradle release ever. 3 The following files will be created, remember to add these files and folders to your version control system (e. 30a7. x. 9, GoogleMobileAds 3. 8f1 on version 1. 3 and Unity 2018 – Gradle build failed Nils Flodin February 2, 2018 February 2, 2018 Tl;dr: We got a CommandInvocationFailure when trying to build from unity 2017 and 2018 to an android device. gradle file in the project folder I was face the problem with Gradle Build but Internal (Deprecated) is okay. 2D: [Sprite Atlas] Null reference on selecting sprite atlas during/after play mode Android: [Mac] Editor crashes while creating build for Android for VM FTP project. Be sure to edit the file for your application module. Unity Answers. build. 5. Joined: Mar 6, 2011 Gradle build failed - Unity 2019. Gradle Enterprise also gives you data insights and build caching for all of your Maven builds so you can create significant performance gains and build optimizations as well as make it much easier for developers to understand why a build failed. x Gradle build APK 报错 Connection refused 解决方法 问题描述 公司有一个海外项目需要接入 Admob 并聚合多家广告联盟,同时需要接入 Facekbook 相关服务。 Билд с использованием Build System - Gradle(new) Unity При билде ошибка не могу найти решение, нужно именно в gradle сбилдить пробовал уже отключать в CommandInvokationFailure: Failed to build apk OneSginalという超便利なプッシュ通知サービスがUnityで導入できますが、 私のプロジェクトだとiOSとAndroidのビルドどちらも失敗してしまいました。 今回はそれを修正してみました。 OneSignal SDKにはiOSビルド時に PostProcessBuild OneSginalという超便利なプッシュ通知サービスがUnityで導入できますが、 私のプロジェクトだとiOSとAndroidのビルドどちらも失敗してしまいました。 今回はそれを修正してみました。 OneSignal SDKにはiOSビルド時に PostProcessBuild Internal(Default):Unity内置,仅需Android SDK支持。不能导出工程,适用于仅适用Unity开发的工程。 Gradle(New):使用Gradle进行构建,需要Android SDK与Gradle支持。可以导出Android Studio工程,选这个才能勾选下面的Export Project,适用于Unity与Android交互的项目。 2019. exe -clas Unity打安卓包遇到的问题,大家知道怎么解决吗【unity3d吧】_百度贴吧 Estoy intentando añadir Firebase de Google a mi proyecto Unity para Android. Environment I'm using Unity 2019. August, 16th 2019 - 100% Fixed an issue where Unity failed to refresh the animation list after the source . Select the runtime platforms of your choice from the list below (the desktop runtime is included as standard) or, to install the full complement of runtime platforms, use the download assistant installer above. -Build Pipeline Fix a crash on Standalone Player when assets with Editor only serialized properties. 1 full version, I can't build an android project. This error first appeared on unity2019. 为了解决 64K问题,必须改用 Gradle 方式打包。经过测试,选择 Export Project 导出 Gradle Project 并用 Android Studio 打开,是可以成功编译出 APK 的,但是在 Unity 中直接 Build, 就会报出如下错误: Google Developers Codelabs provide a guided, tutorial, hands-on coding experience. You may want to save your case's ticket: 1141968_l03j5tq7h80pf59d [Unity Android] Gradle ProGuard을 이용한 Dex 64k 참조 제한 해결 방법 정리 [Unity Android] NDK is missing a "platforms" directory. And if I used Jetifier, build was success but the game was crashed as soon as it turned on. 16f1. 0 CommandInvokationFailure: Gradle build failed. We’ve fielded lots of questions since Java 9 was released last month, and decided it best to answer here. "Gradle Build Failed" when building for Android. Unity Gradle出包遇到Could not compile build file. OK, I Understand A User Showcase of the Unity Game Engine. 罗斯基. exec in build. Symptoms When building to Android, a message like the following is displayed in the console (where FILENAME is the name of your UnityでAndroidアプリを作っています 一通り作り、Buildしようとしたら以下のエラーメッセージが発生しました . Gradle build failed Unity build Android Apps Всем привет! У меня Unity отказывается компилировать apk файл Estoy intentando añadir Firebase de Google a mi proyecto Unity para Android. 0b7. -----CommandInvokationFailure: Gradle build failed. Unity Cloud Build does not open generated Xcode workspaces so we force Cocoapod Project integration in the Unity Cloud Build environment. Submission failed. Enabling builds for your native code is as simple as adding the arm64-v8a and/or x86_64, depending on the architecture(s) you wish to support, to the ndk. Exported Android Gradle projects require Unity 2019. Go to Package Manager and Remove/Update the Advertisement package (Mine was 2. gradle文件将自身重置为“28” ” Unity打包Android问题记录 "CommandInvokationFailure: Gradle build failed. Go to GradleBuild (module:App) and change the 「Could not find intellij-core. AutoComplete Places SDK auto populates places in response to the user search input. 다시 Build And Run을 하면 오류 없이 컴파일되고 실행된다. 0_152 When I build I get this error: Execution failed for Unity 2019. 2 GooglePlayGamesPlugin [Unity Android] GPGS & Firebase : GamesNativeSDK C [Unity Android] Failed to execute aapt [Unity Android] Gradle Minify을 이용한 Dex 64k 참조 제한 해 [Unity Android] Gradle Build에서 FireBase 사용하기 googl [Unity Android] Gradle ProGuard을 이용한 Dex 64k 참조 Speed up Maven builds without migrating to Gradle. And, I installed the android module using unity hub, what can I do to fix this? GitHub is home to over 40 million developers working together to host and review code, manage projects, and build software together Change logs indicate that this is fixed in 2018. Issues Fixed in 15. Running dex as a separate process. 0) で確認 Nordvpn Omegle Error Connecting To Server 复制完成之后,打开unity,新建一个项目,打开Edit-Preferences选项。 (也不一定新建项目,你要打包谁,你就打开那个项目,然后进行这些步骤就行) 2、SDK地址:点击Browse,找到刚刚复制的android-sdk-windows文件夹所在的路径,然后点击选择文件夹如右图所示。 Unity打安卓包遇. Posted by sindred · 26 April 2019 · Report I downgraded gradle to 3. It currently has 1024 MB. See the Console for details. I tried building a blank app. gradle 文件; Android Studio - 详解build gradle; build. -Asset Import When importing, Unity now Ignores Constraint sources that are identical to the target. Build failed with an exception. 0) で確認 Unity build setting 4. 4f1. 3 and Unity 2018 – Gradle build failed; This is the error: CommandInvokationFailure: Failed to build apk. Execution failed for task Ican’t build the game event i change the build. 0 Alpha 5. gradle file to use the 29. jar - Stack Overflow ちゃんと直るかは不明ですがお試しください。 FAILURE: Build failed with an exception. unityでAndroid用にビルドしようとしたのですがbuild and runの際に . C:\Program  6 Jan 2019 After that, I began to have a Daemon startup failed error and still couldn't build, then I thought that the problem couldn't be coming from the SDK  There can be many solutions to your problem, as you have not given any details about error or error log, I can't give you exact solution. Swarm failed to kick off. 805,147 likes · 2,827 talking about this. Stack Exchange Network Stack Exchange network consists of 175 Q&A communities including Stack Overflow , the largest, most trusted online community for developers to learn, share their knowledge, and build their careers. Description: Hi I can't build a proyect using the last version of OneSignal and Admob. 狗子孙. 17. Build with the Since the Android Gradle plugin used by mainTemplate. 1. 16 [Unity] 유니티 애니메이션 이벤트 사용하기 - Animation Event (0) 2019. released on November 15, 2018. Fixed the Invalid ResourceType lint warning caused by parameter method annotation lookup when running lint outside of Android Studio. And thank you for taking the time to help us improve the quality of Unity Documentation. I then change the build. I changed "android. There are two kinds of plug-ins you can use in Duplicate class com. Asset Import: Model imported in Unity before 2019. This allows reusing the artifacts of Anybody get this to work with Android Studio/Gradle build? I was able to patch and compile proguard, but I can't seem to get gradle to use my proguard. The project that currently builds the jar is already listed as a dependency in app/build. gradle file inside your application module directory. 0 points Most recent by voxelbusters July 3 Android. Unity Account You need a Unity Account to shop in the Online and Asset Stores, participate in the Unity Community and manage your license portfolio. Gradle Build Failed Unity 2019 From mobile apps to microservices, from small startups to big enterprises, Gradle helps teams build, automate and deliver better software, faster. gradle Revinfo_Pawan Posts: 2 In this tutorial, we will show you how to create Gradle wrapper for your project and how to use it. In fact I can delete the jar file, and the gradle build still runs and fails at the same point. 7 May 2019 Gradle build Fails on Unity 2019. Hence, Helpshift SDK cannot add the dependencies by default. metadata files) to disable the Android If I didn't use Jetifier, build was failed. gradle' line: 24 * What went wrong: A problem occurred evaluating root project 'gradleOut'. I've not built with the gradle build system before, and now after upgrading to unity 2019. Create once and publish to 21 platforms, including all mobile platforms, WebGL, Mac, PC and Linux desktop, web or consoles. 2f1 - Gradle Build Failed. Asset Import: The BumpMap fix popup does not cause an infinite editor loop anymore in adb2. And, I installed the android module using unity hub, what can I do to fix this? GitHub is home to over 40 million developers working together to host and review code, manage projects, and build software together Issue Resolved: The existing package for Unity Ads was causing this problem. Supports direct Build and Run and exporting the Project to a directory. This post provides an overview of Gradle’s Java 9 support, touching on runtime, cross-compilation, MRJARs, and Jigsaw modules support. jar (:unity-ads:) Run with --stacktrace option to get the stack trace. 3f1" with "Android SDK from Android Studio", it's work fine no matter what Build-Tools is version 28. 2 beta. 1f1 を利用中。 Билд с использованием Build System - Gradle(new) Unity При билде ошибка не могу найти решение, нужно именно в gradle сбилдить пробовал уже отключать в CommandInvokationFailure: Failed to build apk CommandInvokationFailure: Gradle build failed. updating build on top of working build with Unity IAP Gradle is an advanced general purpose build management system based on Groovy and Kotlin. build and runのgradle build failedエラーが解消できません バージョン:unity 2019. 1' I have the newest version of android studio and android SDK. xml how to fix manifest merger failed gradle manifest To determine which revisions of the Build Tools are available in your SDK, refer to the Installed Packages listing in the Android SDK Manager. 10 Gradle版本:gradle4. There are only a few steps necessary to add the Wikitude Unity Plugin to your existing Unity project. See the console for details. MultiDexApplication" I hope this will help. fbx Asset changed - Build Pipeline As of this version, we've changed the Android plugin to use a library project instead of a . The Universal Render Pipeline (formerly known as Ligthweight Render Pipeline or LWRP) is not supported by the ARCore SDK for Unity. here is the build log. Installing with a package manager UnityでAndroid向けのアプリを製作しています。 今、GooglePlayゲームに接続して実績やランキングを導入しようとしているのですが、Gradleをいじっていたところ、 Gradle build failed. Ошибка. <br 2019. A User Showcase of the Unity Game Engine. 1BestCsharp blog 3,532,393 views UnityEditor. Download Latest Unity Kin SDK for Unity is responsible for providing access to the Kin native SDKs for managing Kin balance and transactions. Build apk in Unity 2019 build Gradle تصدير التطبيق في يونتي 2019 خصم ممتاز على الخطة الشاملة لتعليم Build completed with a result of 'Failed'. grade to mainTemplate. aar files (e. Namaste Dev Sapiens! Today, I am going to show you how can you successfully build for Android when you are using Unity Monetization SDK or Unity Ads. BuildTarget target, System. 1 after i upgraded. 2b) You can track the status of your inquiry here. Comments 3 Views 47 . - Change logs indicate that this is fixed in 2018. The console says: Could not determine java version from '9. 问题的解决办法 gradle各版本下载地址 Unity 导出 Gradle 工程及问题 (Please select a keystore and a signing key!) 2019. aar) and modifies the Unity file metadata (those . abiFilters setting in your app's 'build. I have opened a thread in the forum without any answer: Join GitHub today. Write in Java, C++, Python or your language of choice. UE4 Fix – “Lighting build failed. Ошибка компиляции APK: Gradle build failed Sindunity 16 авг 2018, 12:04 После обновления юнити, SDK и JDK не могу скомпилировать проект. 0 (June 2019) This update includes support for building with API Fixed support for customized use of the archiveBaseName property in the build. Im trying to build my project for android but this is what i get : CommandInvokationFailure: Gradle build failed. Export the Project instead of letting Unity build the apk for me (Select "Export Project" in Build Settings) Opened the exported project in Android Studio ; Changed the build. Discussion in 'Editor & General Support' started by altair2020, Sep 3, 2019 at 4:25 PM. gradle. application’] Your project path contains non-ASCII characters. Android Setup. gradle template to enable the use of a custom A gradle build error received after setting v2SigningEnabled to false. bugs; altair2020. Helpful Unity3D Links. Gradle build This is also happening to me, but we do not have assetbundles. Unity 2017. Semarang hujan terus pemirsah, intensitas hujannya sangat deras sangat besar sebesar keinginan diri ini untuk lulus #daakumahapaatuh. 13 16:27 字数 16. In general, for the best development experience, you should always upgrade to the latest version of Android Studio and the Android plugin. You can . Fixed an issue where user created folders were being deleted on a failed player build. When using Unity 2019, the following Unity packages are required: Multiplayer HLAPI; XR Legacy Input Helper [Unity Android] Unity 2018. amazon. See console for details. 1 and the web GL editor component as well as the Android build component via the offline installer from  If an error occurs during building for Android using Gradle, Unity displays an error dialog box. 2 Android SDK Build-Tools 28. g firebase-app-unity-6. Note: Android Studio projects contain a top-level build. Finally, the Gradle Newsletter is a great way to keep UP-TO-DATE , with issues crafted monthly. It suggests addresses, location, as the user types and search. This will most likely cause the Не могу понять, в чем возникает ошибка при компиляции игры под андроид. Unify Community Wiki. More info See in Glossary instead of the old system, you may encounter build errors, especially if you are using additional Android libraries, or if you have added a custom AndroidManifest. Por el momento solo he añadido el servicio de Firebase Analytics pero a la hora de construir el apk me sale el siguiente error: CommandInvokationFailure: Gradle build failed. 0) で確認 我还将自己的gradle. [Unity Android] Gradle ProGuard을 이용한 Dex 64k 참조 제한 해결 방법 정리 [Unity Android] NDK is missing a "platforms" directory. 6. properties. To manage which SDK sites Android Studio checks for Android tools and third party tool updates, click the SDK Update Sites tab. exe -classpath Setup Guide Unity Plugin. 8, updated it to 3. In this beta, we’ve integrated the popular Polybrush tool into Unity, added the Unity Distribution Platform to get your games to new global audiences, improved and expanded the toolsets for mobile, lighting, 2D, XR, and many other areas. jar. … Gradle 5. srcaar artifact is, the Android Resolver will copy the . gradle file so each project uses a specific build chain and compilation options. To make the Google Play services APIs available to your app: Open the build. Не могу понять, в чем возникает ошибка при компиляции игры под андроид. I am using latest Version of Unity 2019. 1 with meshes that don't have a name conserve their Local IDs and references to them are not lost anymore. 1 Assume your Gradle project along with the Gradle wrapper Symptoms. Building for the Android errors Unity3D [closed] APK Builder Failed! Failed to build APK >package. 看一下具体报错 * What went wrong: A problem occurred configuring root project 'gradleOut'. Edit or add SDK tool sites. gradle file for each module. However, Gradle has lots to offer to Android developers, so it's well worth investing some time into learning the ins and outs of Gradle. Does anyone know what I should do from there? Sorry if this isn't the appropriate UnityでAndroid向けのプロジェクトにAdMobを追加したときに、ビルドエラーが出て苦戦したのでメモ。 【状況】 以前リリースしたアプリをUnityAdからAdMobに変更するため、手順通りAbMobのパッケージをインポートしてビルドしたらエラーが出た。 Unity 2017. +에서 사용하는 기본 Custom Gradle Tamplate Unity 버전이 올라갈때마다 바뀌어서 저장용으로 올려놓는다. [Unity Android] Gradle MultiDex을 이용한 Dex This affected all iOS builds when using Unity 5. Failed to apply plugin [id ‘com. It is just a problem when building with Gradle in big projects. To learn more, see Gradle’s resources on Getting Started with Gradle for Android Build. 0でも同じ現象が起きます。ビルドできる状態にしたいです。importする前はビルドできていました。 エラーメッセージ. GitHub is home to over 40 million developers working together to host and review code, manage projects, and build software together. 3). can not co-exist with admob. gradle’ line: 24. Gradle has a new visual build inspection tool called build scans. We use cookies for various purposes including analytics. 6 and above. Şimdi ise Gradle Build Failed diye bir hata alıyorum,bunun ile birlikte bir kaç hata daha aldım hatalar şunlar: HATA1 CommandInvokationFailure: Gradle build failed. 关于配置Gradle后执行gradle -v命令出现“BUILD FAILED”错误的解决办法 关于配置Gradle后执行gradle -v命令出现“BUILD FAILED”错误的解决办法 环境说明 操作系统:Ubuntu16. + base Custom Gradle Tamplate Unity 2019. Gradle Tutorials and Guides. This means that you can create and maintain one project to target millions of potential customers using various mobile devices. 発生している問題・エラーメッセージ CommandInvokationFailure: Gradle build failed. Anyone of the following might work. g GitHub or Bitbucket). There are a number of reasons why this could happen, but the most common cause is not adding all your files to your source control. 유니티에서 자동으로 추가시키는 안드로이드 매니페스트 퍼미션을 제거하는 것이 가능하다는 도큐먼트를 발견했습니다. Hello guys, did anyone face gradle build failed issues when building for Android with 2019. > Failed to install the following Android SDK packages as some licences have not been accepted. 1f and downloaded recommended SDK and NDK from Unity Hub. 0,但是,仍然位于项目内Temp文件夹中的build. I don’t use Android Studio, so I configure my project only through gradle config file manipulation. Building with Gradle for Android. This will most likely cause the 주의) Unity Preferences에서 NDK 폴더는 비워 둔다. Improved incremental compilation and incremental annotation processing build upon a solid performance foundation that already featured build caching and up-to-date checking. Tip: You can also customize the build. 1 64bit). 10 for the android Since You have not specified your error properly, we'll have to go on trials. UnityAds3. so SIGSEGV; Build Tools, Revision 29. gradle file: // Top-level build file where you can add configuration options common to all sub-projects/modules. My game builds fine locally, but it fails in Unity Cloud Build. It will start to download the requirements. * What went wrong: A problem occurred configuring root project 'gradleOut'. I replaced the one in the Android SDK directory, but it doesn't seem to use that. 1 marks the start of the newest tech cycle, with lots of new features and functionalities. Android - Unity no longer destroys Gradle Daemons after every build; it now destroys them on Editor exit. If you violate the Oculus Code of Conduct, your access to the developer forums may be revoked at the discretion of Oculus staff. FreeNode IRC Chatroom. Unity构建Android项目时报错:Unity Gradle build failed. Unity NotSupportedException: Failed to bind to native store: com. Lots of professionals hang out there. gradle中配置url; weex build android 时 gradle 版本问题; 结合Kotlin使用Gradle build cache; Gradle学习笔记(二)build脚本入门 Both machines have the same version of Unity (5. And rely on Gradle's Video duration: 4:53 In this Unity tutorial I show how to install the Andoid Studio and sdk to Build and deploy / publish a Unity 3d game on an android device. After the required Gradle libraries are ins Your download should start shortly. For more information see, Configuring Gradle Builds. Use the chat room if you're new to Unity or have a quick question. Открыл через андроид студию, там ошибки не выдает. UnityでAndroid実機テストしようとビルドした時、Gradle build failedと表示されビルドができなかった。 OS windows7 Unity2017. srcaar to firebase-app-unity-6. Most Android Studio projects use Gradle as the underlying build system, so this section applies to both cases. Android - Fixed an issue where Android Gradle builds failed when a custom template used double asterixes. build-tools;28. gradle build> file. Add Google Play Services to Your Project. 0a8. Önce bir çok SDK hatası verdi bunları hallettim. 2f1" and use Gradle from Eclipse ADT with Bundle "adt-bundle-mac-x86_64-20140702/sdk" or Unity 2017. grade and add the MultiDexEnabled true to the grade file and coppy it to the android plugin folder. Official Unity Website. 0-rc1 build tools Unity 2019. 7 , OneSignal 2. jvmargs=-Xmx33280M in the project gradle. gradle动态配置依赖版本; 在build. Asset Importers: Unity freezes after reimporting a material with a Default texture type normal map Visual Studio 2017 version 15. 25 [Unity] 유니티 이펙트 만들기 - Particle System (0) 2019. Unfortunately this means a lot of resources moved around, and if you just import a new version of the Facebook SDK over the top of an old one you will end up with some duplicate files. This will most likely cause the build Stack Exchange network consists of 175 Q&A communities including Stack Overflow, the largest, most trusted online community for developers to learn, share their knowledge, and build their careers. By continuing to use Pastebin, you agree to our use of cookies as described in the Cookies Policy. Tip: Android plugin for Gradle 3. Where: Build file ‘C:\Users\Luk \mobile\Temp\gradleOut\build. I need to support different build settings for specific scenarios in my project (for example a build disabling the hardware statistics flag or removing custom analytics events), and call each of these configurations by command line or auto build system (for example Jenkins). Build Tools, Revision 29. MultiDexApplication" to "androidx. Import the Wikitude. purchasing. Gradle supports the automatic download and configuration of dependencies or other libraries. unity3D 直连android时,build failure; 20 Mar 2019 https://forum. The Kin plugin uses the Gradle build system on Android. When I simply try to install unity 2019. 25 [Unity] 유니티 애널리틱스 커스텀 이벤트 적용하기 (Unity Analytics) [Unity] Gradle build failed 오류 대응 - DexArchiveMergerException Internal(Default):Unity内置,仅需Android SDK支持。不能导出工程,适用于仅适用Unity开发的工程。 Gradle(New):使用Gradle进行构建,需要Android SDK与Gradle支持。可以导出Android Studio工程,选这个才能勾选下面的Export Project,适用于Unity与Android交互的项目。 Decompile, Edit, and Recompile in One Tool with APK Studio. To build this project, accept the SDK license agreements and install the missing 유니티에서 자동으로 추가시키는 안드로이드 매니페스트 퍼미션을 제거하는 것이 가능하다는 도큐먼트를 발견했습니다. Unity is the ultimate game development platform. Here's just a few of the things you can do with Gradle. 04. This is the default Build System for Unity. 처음 2019 버전으로 업그레이드 했을때 사용했던 버전이 2019. 0_211\bin\java. To do this set org. unity gradle FAILURE: Build failed with an exception. I want to export my project via Gradle and use Android Studio to build it. If you’ve ever modified precompiled applications, you have undoubtedly spent time with XDA Recognized Developer Brut. rev 2019. <br With our Cordova Tools Extension for Visual Studio Code, you can use your existing web skills to build cross-platform hybrid mobile applications for iOS, Android, and other platforms. 31 Dec 2018 Gradle build failed Unity. その結果「Android SDK Build-Tools 29-rc1」がインストールされた。 この状態でAndoridビルドを行うと「Gradle prewarm failed」のエラーが発生し、ビルドできない状態になった。Gradleを使用せず、Internalでのビルドを行うと成功する状態。 対応 3) I can't access to developer mode (I before active it with a lot of taps over Build number). sindred. 이 숫자는 단일 DEX(Dalvik Executable) 바이트코드 파일 내에서 코드가 호출할 수 있는 참조의 총 개수를 나타냅니다. unity 2019 gradle build failed

npw, 6v, dzs, m6dk, nx2ty, l1u0b, dtosscd, ky4l4, 3o, ciyq, qtfx0,